Target
Somatostatin receptor type 1
Ligand
BDBM82455
Substrate
Ki
1000±n/a nM
Comments
PDSP_375
Citation
 Raynor, KMurphy, WACoy, DHTaylor, JEMoreau, JPYasuda, KBell, GIReisine, T Cloned somatostatin receptors: identification of subtype-selective peptides and demonstration of high affinity binding of linear peptides. Mol Pharmacol 43:838-44 (1993) Target
Name:
Somatostatin receptor type 1
Synonyms:
SOMATOSTATIN SST1 SS-1-R SS1R SSTR1 | Somatostatin receptor type 1 (SSTR1)
Type:
Enzyme
Mol. Mass.:
42692.81
Organism:
Homo sapiens (Human)
Description:
P30872
Residue:
391
  
Inhibitor
Name:
BDBM82455
Synonyms:
BIM 23027 N-Methylcyclo[L-Ala-L-Tyr-D-Trp-L-Lys-L-Abu-L-Phe-]
Type:
Small organic molecule
Emp. Form.:
C43H54N8O7
Mol. Mass.:
794.9383
SMILES:
CC[C@@H]1NC(=O)[C@H](CCCCN)NC(=O)[C@@H](Cc2c[nH]c3ccccc23)NC(=O)[C@H](Cc2ccc(O)cc2)NC(=O)[C@H](C)N(C)C(=O)[C@H](Cc2ccccc2)NC1=O
: