Target
Somatostatin receptor type 2
Ligand
BDBM82469
Substrate
Ki
0.005±n/a nM
Comments
PDSP_372
Citation
 Raynor, KMurphy, WACoy, DHTaylor, JEMoreau, JPYasuda, KBell, GIReisine, T Cloned somatostatin receptors: identification of subtype-selective peptides and demonstration of high affinity binding of linear peptides. Mol Pharmacol 43:838-44 (1993) Target
Name:
Somatostatin receptor type 2
Synonyms:
SOMATOSTATIN SST2 Smstr2 Somatostatin receptor 2 Sst2 | Sstr2
Type:
Enzyme Catalytic Domain
Mol. Mass.:
41234.26
Organism:
MOUSE
Description:
SOMATOSTATIN SST2 SSTR2 MOUSE::P30875
Residue:
369
  
Inhibitor
Name:
BDBM82469
Synonyms:
BIM 23003 EC5-21 | L-Cys(1)-L-Lys-L-Asn-4-Chloro-L-Phe-L-Phe-D-Trp-L-Lys-L-Thr-L-Phe-L-Thr-L-Ser-L-Cys(1)-OH
Type:
Small organic molecule
Emp. Form.:
C71H95ClN16O17S2
Mol. Mass.:
1544.194
SMILES:
C[C@@H](O)[C@@H]1NC(=O)[C@H](CCCCN)NC(=O)[C@@H](Cc2c[nH]c3ccccc23)NC(=O)[C@H](Cc2ccccc2)NC(=O)[C@H](Cc2ccc(Cl)cc2)NC(=O)[C@H](CC(N)=O)NC(=O)[C@H](CCCCN)NC(=O)[C@@H](N)CSSC[C@H](NC(=O)[C@H](CO)NC(=O)[C@@H](NC(=O)[C@H](Cc2ccccc2)NC1=O)[C@@H](C)O)C(O)=O
: