Target
Somatostatin receptor type 3
Ligand
BDBM82463
Substrate
Ki
30±n/a nM
Comments
PDSP_1033
Citation
 Raynor, KMurphy, WACoy, DHTaylor, JEMoreau, JPYasuda, KBell, GIReisine, T Cloned somatostatin receptors: identification of subtype-selective peptides and demonstration of high affinity binding of linear peptides. Mol Pharmacol 43:838-44 (1993) Target
Name:
Somatostatin receptor type 3
Synonyms:
SOMATOSTATIN SST3 SSR-28 Smstr3 Somatostatin receptor 3 Sstr3
Type:
Enzyme Catalytic Domain
Mol. Mass.:
47225.49
Organism:
MOUSE
Description:
SOMATOSTATIN SST3 SSTR3 MOUSE::P30935
Residue:
428
  
Inhibitor
Name:
BDBM82463
Synonyms:
Cyclo[L-Trp-D-Trp-L-Lys-L-Thr-L-Phe-(7-amino*heptanoyl-L-Phe-)] L-362855
Type:
Small organic molecule
Emp. Form.:
C57H70N10O8
Mol. Mass.:
1023.2279
SMILES:
C[C@@H](O)[C@@H]1NC(=O)[C@H](CCCCN)NC(=O)[C@@H](Cc2c[nH]c3ccccc23)NC(=O)[C@H](Cc2c[nH]c3ccccc23)NC(=O)[C@H](Cc2ccccc2)NC(=O)CCCCCCNC(=O)[C@H](Cc2ccccc2)NC1=O
: