Target
Somatostatin receptor type 4
Ligand
BDBM82455
Substrate
Ki
6.2±n/a nM
Comments
PDSP_375
Citation
 Raynor, KO'Carroll, AMKong, HYasuda, KMahan, LCBell, GIReisine, T Characterization of cloned somatostatin receptors SSTR4 and SSTR5. Mol Pharmacol 44:385-92 (1993) Target
Name:
Somatostatin receptor type 4
Synonyms:
SOMATOSTATIN SST4 Somatostatin receptor Sstr4
Type:
Enzyme Catalytic Domain
Mol. Mass.:
42096.84
Organism:
RAT
Description:
SOMATOSTATIN SST4 SSTR4 RAT::P30937
Residue:
384
  
Inhibitor
Name:
BDBM82455
Synonyms:
BIM 23027 N-Methylcyclo[L-Ala-L-Tyr-D-Trp-L-Lys-L-Abu-L-Phe-]
Type:
Small organic molecule
Emp. Form.:
C43H54N8O7
Mol. Mass.:
794.9383
SMILES:
CC[C@@H]1NC(=O)[C@H](CCCCN)NC(=O)[C@@H](Cc2c[nH]c3ccccc23)NC(=O)[C@H](Cc2ccc(O)cc2)NC(=O)[C@H](C)N(C)C(=O)[C@H](Cc2ccccc2)NC1=O
: