Target
Somatostatin receptor type 4
Ligand
BDBM82456
Substrate
Ki
3.9±n/a nM
Comments
PDSP_376
Citation
 Raynor, KO'Carroll, AMKong, HYasuda, KMahan, LCBell, GIReisine, T Characterization of cloned somatostatin receptors SSTR4 and SSTR5. Mol Pharmacol 44:385-92 (1993) Target
Name:
Somatostatin receptor type 4
Synonyms:
SOMATOSTATIN SST4 Somatostatin receptor Sstr4
Type:
Enzyme Catalytic Domain
Mol. Mass.:
42096.84
Organism:
RAT
Description:
SOMATOSTATIN SST4 SSTR4 RAT::P30937
Residue:
384
  
Inhibitor
Name:
BDBM82456
Synonyms:
BIM 23030 | CAS_117580-24-2
Type:
Small organic molecule
Emp. Form.:
C45H57N9O8S2
Mol. Mass.:
916.12
SMILES:
CC(C)[C@@H]1NC(=O)[C@H](CCCCN)NC(=O)[C@@H](Cc2c[nH]c3ccccc23)NC(=O)[C@H](Cc2ccc(O)cc2)NC(=O)CCSSC(NC1=O)C(=O)N[C@@H](Cc1ccccc1)C(N)=O
: