Target
Somatostatin receptor type 4
Ligand
BDBM84629
Substrate
Ki
43±n/a nM
Comments
PDSP_385
Citation
 Raynor, KO'Carroll, AMKong, HYasuda, KMahan, LCBell, GIReisine, T Characterization of cloned somatostatin receptors SSTR4 and SSTR5. Mol Pharmacol 44:385-92 (1993) Target
Name:
Somatostatin receptor type 4
Synonyms:
SOMATOSTATIN SST4 Somatostatin receptor Sstr4
Type:
Enzyme Catalytic Domain
Mol. Mass.:
42096.84
Organism:
RAT
Description:
SOMATOSTATIN SST4 SSTR4 RAT::P30937
Residue:
384
  
Inhibitor
Name:
BDBM84629
Synonyms:
BIM 23056
Type:
Small organic molecule
Emp. Form.:
C71H81N11O9
Mol. Mass.:
1232.4711
SMILES:
CC(C)[C@H](NC(=O)[C@H](CCCCN)NC(=O)[C@@H](Cc1c[nH]c2ccccc12)NC(=O)[C@H](Cc1ccc(O)cc1)NC(=O)[C@H](Cc1ccccc1)NC(=O)[C@H](N)Cc1ccccc1)C(=O)N[C@@H](Cc1ccccc1)C(=O)N[C@H](Cc1cccc2ccccc12)C(N)=O
: