Target
Somatostatin receptor type 4
Ligand
BDBM50065453
Substrate
Ki
3.2±n/a nM
Comments
PDSP_1035
Citation
 Raynor, KO'Carroll, AMKong, HYasuda, KMahan, LCBell, GIReisine, T Characterization of cloned somatostatin receptors SSTR4 and SSTR5. Mol Pharmacol 44:385-92 (1993) Target
Name:
Somatostatin receptor type 4
Synonyms:
SOMATOSTATIN SST4 Somatostatin receptor Sstr4
Type:
Enzyme Catalytic Domain
Mol. Mass.:
42096.84
Organism:
RAT
Description:
SOMATOSTATIN SST4 SSTR4 RAT::P30937
Residue:
384
  
Inhibitor
Name:
BDBM50065453
Synonyms:
(5S,8S,11S,14R,17S,19aS)-11-(4-Amino-butyl)-5,17-dibenzyl-8-((R)-1-hydroxy-ethyl)-14-(1H-indol-3-ylmethyl)-tetradecahydro-3a,6,9,12,15,18-hexaaza-cyclopentacyclooctadecene-4,7,10,13,16,19-hexaone L-361,301 L-363301
Type:
Small organic molecule
Emp. Form.:
C44H54N8O7
Mol. Mass.:
806.949
SMILES:
C[C@@H](O)[C@@H]1NC(=O)[C@H](CCCCN)NC(=O)[C@@H](Cc2c[nH]c3ccccc23)NC(=O)[C@H](Cc2ccccc2)NC(=O)[C@@H]2CCCN2C(=O)[C@H](Cc2ccccc2)NC1=O
: