Target
Somatostatin receptor type 5
Ligand
BDBM82469
Substrate
Ki
1.8±n/a nM
Comments
PDSP_372
Citation
 Raynor, KO'Carroll, AMKong, HYasuda, KMahan, LCBell, GIReisine, T Characterization of cloned somatostatin receptors SSTR4 and SSTR5. Mol Pharmacol 44:385-92 (1993) Target
Name:
Somatostatin receptor type 5
Synonyms:
SOMATOSTATIN SST5 SS5-R SSR5_HUMAN Somatostatin receptor type 5 (SSTR5)
Type:
Enzyme
Mol. Mass.:
39218.02
Organism:
Homo sapiens (Human)
Description:
P35346
Residue:
364
  
Inhibitor
Name:
BDBM82469
Synonyms:
BIM 23003 EC5-21 | L-Cys(1)-L-Lys-L-Asn-4-Chloro-L-Phe-L-Phe-D-Trp-L-Lys-L-Thr-L-Phe-L-Thr-L-Ser-L-Cys(1)-OH
Type:
Small organic molecule
Emp. Form.:
C71H95ClN16O17S2
Mol. Mass.:
1544.194
SMILES:
C[C@@H](O)[C@@H]1NC(=O)[C@H](CCCCN)NC(=O)[C@@H](Cc2c[nH]c3ccccc23)NC(=O)[C@H](Cc2ccccc2)NC(=O)[C@H](Cc2ccc(Cl)cc2)NC(=O)[C@H](CC(N)=O)NC(=O)[C@H](CCCCN)NC(=O)[C@@H](N)CSSC[C@H](NC(=O)[C@H](CO)NC(=O)[C@@H](NC(=O)[C@H](Cc2ccccc2)NC1=O)[C@@H](C)O)C(O)=O
: