Target
D(3) dopamine receptor
Ligand
BDBM81791
Substrate
Ki
617±n/a nM
Comments
PDSP_878
Citation
 Tang, LTodd, RDHeller, AO'Malley, KL Pharmacological and functional characterization of D2, D3 and D4 dopamine receptors in fibroblast and dopaminergic cell lines. J Pharmacol Exp Ther 268:495-502 (1994) Target
Name:
D(3) dopamine receptor
Synonyms:
DOPAMINE D3 Dopamine D3 receptor | Drd3
Type:
Protein
Mol. Mass.:
49540.58
Organism:
Rattus norvegicus (Rat)
Description:
P19020
Residue:
446
  
Inhibitor
Name:
BDBM81791
Synonyms:
Dopamine + GPP(NH)p GPP(NH)p(-) | Guanylyl imidodiphosphate
Type:
Emp. Form.:
C10H17N6O13P3
Mol. Mass.:
522.1957
SMILES:
Nc1nc2n(cnc2c(=O)[nH]1)[C@@H]1O[C@H](COP(O)(=O)OP(O)(=O)NP(O)(O)=O)[C@@H](O)[C@H]1O
: