Target
Sodium-dependent dopamine transporter
Ligand
BDBM22397
Substrate
Ki
10±n/a nM
Comments
PDSP_1961
Citation
 Pristupa, ZBWilson, JMHoffman, BJKish, SJNiznik, HB Pharmacological heterogeneity of the cloned and native human dopamine transporter: disassociation of [3H]WIN 35,428 and [3H]GBR 12,935 binding. Mol Pharmacol 45:125-35 (1994) Target
Name:
Sodium-dependent dopamine transporter
Synonyms:
DA transporter DAT1 Dopamine transporter protein (DAT) SC6A3_HUMAN Sodium-dependent dopamine transporter Solute carrier family 6 member 3
Type:
Multi-pass membrane protein
Mol. Mass.:
68497.11
Organism:
Homo sapiens (Human)
Description:
Q01959
Residue:
620
  
Inhibitor
Name:
BDBM22397
Synonyms:
WIN 35,428 methyl (1R,2S,3S,5S)-3-(4-fluorophenyl)-8-methyl-8-azabicyclo[3.2.1]octane-2-carboxylate
Type:
radiolabeled ligand
Emp. Form.:
C16H20FNO2
Mol. Mass.:
277.3339
SMILES:
COC(=O)[C@@H]1[C@H]2CC[C@@H](C[C@@H]1c1ccc(F)cc1)N2C
: