Target
5-hydroxytryptamine receptor 4
Ligand
BDBM81781
Substrate
Ki
1584.89±n/a nM
Comments
PDSP_155
Citation
 Grossman, CJKilpatrick, GJBunce, KT Development of a radioligand binding assay for 5-HT4 receptors in guinea-pig and rat brain. Br J Pharmacol 109:618-24 (1993)  
Target
Name:
5-hydroxytryptamine receptor 4
Synonyms:
5-HT4 5HT4R_CAVPO Serotonin 4 (5-HT4) receptor
Type:
Enzyme Catalytic Domain
Mol. Mass.:
43735.29
Organism:
GUINEA PIG
Description:
5-HT4 HTR4 GUINEA PIG::O70528
Residue:
388
  
Inhibitor
Name:
BDBM81781
Synonyms:
5-HT,a-Me | 5-HT,omega-N-Me
Type:
Emp. Form.:
C11H14N2O
Mol. Mass.:
190.2417
SMILES:
Cn1cc(CCN)c2cc(O)ccc12
: