Target
5-hydroxytryptamine receptor 1A
Ligand
BDBM29568
Substrate
Ki
>10000±n/a nM
Comments
PDSP_1528
Citation
 Pauwels, PJVan Gompel, PLeysen, JE Activity of serotonin (5-HT) receptor agonists, partial agonists and antagonists at cloned human 5-HT1A receptors that are negatively coupled to adenylate cyclase in permanently transfected HeLa cells. Biochem Pharmacol 45:375-83 (1993)  
Target
Name:
5-hydroxytryptamine receptor 1A
Synonyms:
5-HT-1A 5-hydroxytryptamine receptor 1A (5-HT-1A) ADRB2RL1 Dopamine D2 receptor and serotonin 1a receptor HTR1A | Serotonin receptor 1A
Type:
Mol. Mass.:
46122.49
Organism:
Homo sapiens (Human)
Description:
Residue:
422
  
Inhibitor
Name:
BDBM29568
Synonyms:
CHEMBL2 PRAZOSIN HYDROCHLORIDE [3H]-Minipress [3H]-Prazosin
Type:
radiolabeled ligand
Emp. Form.:
C19H21N5O4
Mol. Mass.:
383.4011
SMILES:
COc1cc2nc(nc(N)c2cc1OC)N1CCN(CC1)C(=O)c1ccco1
: