Target
Alpha-1A adrenergic receptor
Ligand
BDBM29568
Substrate
Ki
>10000±n/a nM
Comments
PDSP_1528
Citation
 Barrett, RJMay, JMMartin, PLMiller, JR In vitro and in vivo pharmacological characterization of N6-cyclopentyl-9-methyladenine (N-0840): a selective, orally active A1 adenosine receptor antagonist. J Pharmacol Exp Ther 265:227-36 (1993) Target
Name:
Alpha-1A adrenergic receptor
Synonyms:
ADA1A_RAT Adra1c Alpha-1A adrenoceptor Alpha-1C adrenergic receptor | adrenergic Alpha1A
Type:
Protein
Mol. Mass.:
51620.15
Organism:
Rattus norvegicus (Rat)
Description:
P43140
Residue:
466
  
Inhibitor
Name:
BDBM29568
Synonyms:
CHEMBL2 PRAZOSIN HYDROCHLORIDE [3H]-Minipress [3H]-Prazosin
Type:
radiolabeled ligand
Emp. Form.:
C19H21N5O4
Mol. Mass.:
383.4011
SMILES:
COc1cc2nc(nc(N)c2cc1OC)N1CCN(CC1)C(=O)c1ccco1
: