Target
5-hydroxytryptamine receptor 7
Ligand
BDBM84738
Substrate
Ki
1000±n/a nM
Comments
PDSP_813
Citation
 Shen, YMonsma, FJMetcalf, MAJose, PAHamblin, MWSibley, DR Molecular cloning and expression of a 5-hydroxytryptamine7 serotonin receptor subtype. J Biol Chem 268:18200-4 (1993) Target
Name:
5-hydroxytryptamine receptor 7
Synonyms:
5-HT-7 5-HT7 5-HT7S 5-hydroxytryptamine receptor 7 5HT7R_RAT GPRFO Serotonin (5-HT) receptor | Serotonin Receptor 7
Type:
G Protein-Coupled Receptor (GPCR)
Mol. Mass.:
49852.62
Organism:
Rattus norvegicus (rat)
Description:
Rat cloned 5-HT7R.
Residue:
448
  
Inhibitor
Name:
BDBM84738
Synonyms:
CAS_16105-77-4 Fenfluramine (+) NSC_3337 | d-Fenfluramine
Type:
Small organic molecule
Emp. Form.:
C12H16F3N
Mol. Mass.:
231.2573
SMILES:
CCNC(C)Cc1cccc(c1)C(F)(F)F
: