Target
5-hydroxytryptamine receptor 6
Ligand
BDBM50024204
Substrate
Ki
25.11±n/a nM
Comments
PDSP_1206
Citation
 Plassat, JLAmlaiky, NHen, R Molecular cloning of a mammalian serotonin receptor that activates adenylate cyclase. Mol Pharmacol 44:229-36 (1993) Target
Name:
5-hydroxytryptamine receptor 6
Synonyms:
5-HT6 5HT6R_MOUSE | Htr6
Type:
Enzyme Catalytic Domain
Mol. Mass.:
47012.98
Organism:
MOUSE
Description:
5-HT6 HTR6 MOUSE::Q9R1C8
Residue:
440
  
Inhibitor
Name:
BDBM50024204
Synonyms:
1H-imidazo[4,5-c]pyridine derivative 4,7-dimethyl-(6aR,9S,10aR)-4,6,6a,7,8,9,10,10a-octahydroindolo[4,3-fg]quinolin-9-amino-N,N-dimethyl sulfonamide 9-N,N-dimethylsulfamide-4,7-dimethyl-4,6,6a,7,8,9,10,10a-octahydro-indolo[4,3-fg]quinoline ChEMBL_10959 N'-4,7-Dimethyl-4,6,6a,7,8,9,10,10a-octahydro-indolo[4,3-fg]quinolin-9-yl)-N'-,N'-dimethyl-sulphonediamine
Type:
Small organic molecule
Emp. Form.:
C18H26N4O2S
Mol. Mass.:
362.49
SMILES:
CN(C)S(=O)(=O)N[C@H]1C[C@H]2[C@@H](Cc3cn(C)c4cccc2c34)N(C)C1
: