Target
Substance-P receptor
Ligand
BDBM50000042
Substrate
Meas. Tech.
ChEBML_205879
Ki
49±n/a nM
Citation
 Desai, MCLefkowitz, SLThadeio, PFLongo, KPSnider, RM Discovery of a potent substance P antagonist: recognition of the key molecular determinant. J Med Chem 35:4911-3 (1993)  
Target
Name:
Substance-P receptor
Synonyms:
NK-1 receptor NK1 Receptor NK1R_HUMAN Neurokinin-1 (NK-1) SPR TACR1 Tachykinin receptor 1 (NK1) | tachykinin
Type:
G Protein-Coupled Receptor (GPCR)
Mol. Mass.:
46254.43
Organism:
Homo sapiens (Human)
Description:
P25103
Residue:
407
  
Inhibitor
Name:
BDBM50000042
Synonyms:
(2-Benzhydryl-piperidin-3-yl)-(2-methoxy-benzyl)-amine | CHEMBL147543
Type:
Small organic molecule
Emp. Form.:
C26H30N2O
Mol. Mass.:
386.5292
SMILES:
COc1ccccc1CN[C@H]1CCCN[C@H]1C(c1ccccc1)c1ccccc1
: