Target
Glutamate receptor ionotropic, NMDA 1
Ligand
BDBM18133
Substrate
Meas. Tech.
ChEBML_140855
IC50
6200±n/a nM
Citation
 Johnson, GDrummond, JTBoxer, PABruns, RF Beta-proline analogues as agonists at the strychnine-sensitive glycine receptor. J Med Chem 35:233-41 (1992)  
Target
Name:
Glutamate receptor ionotropic, NMDA 1
Synonyms:
Glutamate (NMDA) receptor subunit zeta 1 Glutamate-NMDA-Channel Glutamate-NMDA-Polyamine NMDA Nmdar1 | phencyclidine
Type:
Enzyme Catalytic Domain
Mol. Mass.:
105533.40
Organism:
RAT
Description:
P35439
Residue:
938
  
Inhibitor
Name:
BDBM18133
Synonyms:
2-aminoacetic acid Glycine | [14C]Glycine
Type:
Amino Acid
Emp. Form.:
C2H5NO2
Mol. Mass.:
75.0666
SMILES:
NCC(O)=O
: