Target
Ribonucleoside-diphosphate reductase large subunit
Ligand
BDBM50000136
Substrate
Meas. Tech.
ChEBML_195384
IC50
73000±n/a nM
Citation
 Gaudreau, PBrazeau, PRicher, MCormier, JLanglois, DLangelier, Y Structure-function studies of peptides inhibiting the ribonucleotide reductase activity of herpes simplex virus type I. J Med Chem 35:346-50 (1992)  
Target
Name:
Ribonucleoside-diphosphate reductase large subunit
Synonyms:
RIR1_HUMAN RRM1 Ribonucleoside-diphosphate reductase subunit M1 | Ribonucleotide reductase large subunit
Type:
PROTEIN
Mol. Mass.:
90074.67
Organism:
Homo sapiens (Human)
Description:
ChEMBL_90946
Residue:
792
  
Inhibitor
Name:
BDBM50000136
Synonyms:
2-{2-[2-(2-{2-[2-(2-{2-[2-Acetylamino-3-(4-hydroxy-phenyl)-propionylamino]-propionylamino}-acetylamino)-3-hydroxy-butyrylamino]-3-methyl-butyrylamino}-3-methyl-pentanoylamino)-4-carbamoyl-butyrylamino]-3-carboxy-propionylamino}-4-methyl-pentanoicacid | CHEMBL264755
Type:
Small organic molecule
Emp. Form.:
C46H72N10O16
Mol. Mass.:
1021.1213
SMILES:
CC[C@@H](C)[C@H](NC(=O)[C@@H](NC(=O)[C@@H](NC(=O)CNC(=O)[C@H](C)NC(=O)[C@H](Cc1ccc(O)cc1)NC(C)=O)[C@@H](C)O)C(C)C)C(=O)N[C@@H](CCC(N)=O)C(=O)N[C@@H](CC(O)=O)C(=O)N[C@@H](CC(C)C)C(O)=O
: