Target
Ribonucleoside-diphosphate reductase large subunit
Ligand
BDBM50000141
Substrate
Meas. Tech.
ChEMBL_195108 (CHEMBL795004)
IC50
1900±n/a nM
Citation
 Gaudreau, PBrazeau, PRicher, MCormier, JLanglois, DLangelier, Y Structure-function studies of peptides inhibiting the ribonucleotide reductase activity of herpes simplex virus type I. J Med Chem 35:346-50 (1992)  
Target
Name:
Ribonucleoside-diphosphate reductase large subunit
Synonyms:
RIR1_HUMAN RRM1 Ribonucleoside-diphosphate reductase subunit M1 | Ribonucleotide reductase large subunit
Type:
PROTEIN
Mol. Mass.:
90074.67
Organism:
Homo sapiens (Human)
Description:
ChEMBL_90946
Residue:
792
  
Inhibitor
Name:
BDBM50000141
Synonyms:
2-{2-[2-(2-{2-[2-(2-{2-[2-Acetylamino-3-(1H-indol-3-yl)-propionylamino]-propionylamino}-acetylamino)-3-hydroxy-butyrylamino]-3-methyl-butyrylamino}-3-methyl-pentanoylamino)-3-carbamoyl-propionylamino]-3-carboxy-propionylamino}-4-methyl-pentanoic acid | CHEMBL269718
Type:
Small organic molecule
Emp. Form.:
C47H71N11O15
Mol. Mass.:
1030.1313
SMILES:
CC[C@@H](C)[C@H](NC(=O)[C@@H](NC(=O)[C@@H](NC(=O)CNC(=O)[C@H](C)NC(=O)[C@H](Cc1c[nH]c2ccccc12)NC(C)=O)[C@@H](C)O)C(C)C)C(=O)N[C@@H](CC(N)=O)C(=O)N[C@@H](CC(O)=O)C(=O)N[C@@H](CC(C)C)C(O)=O
: