Target
Potassium-transporting ATPase alpha chain 1
Ligand
BDBM50000227
Substrate
Meas. Tech.
ChEBML_76079
IC50
500±n/a nM
Citation
 Weidmann, KHerling, AWLang, HJScheunemann, KHRippel, RNimmesgern, HScholl, TBickel, MMetzger, H 2-[(2-pyridylmethyl)sulfinyl]-1H-thieno[3,4-d]imidazoles. A novel class of gastric H+/K(+)-ATPase inhibitors. J Med Chem 35:438-50 (1992)  
Target
Name:
Potassium-transporting ATPase alpha chain 1
Synonyms:
ATP4A Gastric H(+)/K(+) ATPase subunit alpha Na/K-ATPase Potassium-transporting ATPase alpha chain 1 | Proton pump
Type:
Enzyme
Mol. Mass.:
114279.23
Organism:
Sus scrofa (Pig)
Description:
P19156
Residue:
1034
  
Inhibitor
Name:
BDBM50000227
Synonyms:
2-[4-(4-Fluoro-benzyloxy)-pyridin-2-ylmethanesulfinyl]-3H-thieno[3,4-d]imidazole | CHEMBL137943
Type:
Small organic molecule
Emp. Form.:
C18H14FN3O2S2
Mol. Mass.:
387.451
SMILES:
Fc1ccc(COc2ccnc(CS(=O)c3nc4cscc4[nH]3)c2)cc1
: