Target
Potassium-transporting ATPase alpha chain 1
Ligand
BDBM50000259
Substrate
Meas. Tech.
ChEBML_76079
IC50
2000±n/a nM
Citation
 Weidmann, KHerling, AWLang, HJScheunemann, KHRippel, RNimmesgern, HScholl, TBickel, MMetzger, H 2-[(2-pyridylmethyl)sulfinyl]-1H-thieno[3,4-d]imidazoles. A novel class of gastric H+/K(+)-ATPase inhibitors. J Med Chem 35:438-50 (1992)  
Target
Name:
Potassium-transporting ATPase alpha chain 1
Synonyms:
ATP4A Gastric H(+)/K(+) ATPase subunit alpha Na/K-ATPase Potassium-transporting ATPase alpha chain 1 | Proton pump
Type:
Enzyme
Mol. Mass.:
114279.23
Organism:
Sus scrofa (Pig)
Description:
P19156
Residue:
1034
  
Inhibitor
Name:
BDBM50000259
Synonyms:
2-[4-(2,2,3,3,4,4,5,5-Octafluoro-pentyloxy)-pyridin-2-ylmethanesulfinyl]-3H-thieno[3,4-d]imidazole | CHEMBL140688
Type:
Small organic molecule
Emp. Form.:
C16H11F8N3O2S2
Mol. Mass.:
493.395
SMILES:
FC(F)C(F)(F)C(F)(F)C(F)(F)COc1ccnc(CS(=O)c2nc3cscc3[nH]2)c1
: