Target
Kappa-type opioid receptor
Ligand
BDBM50000271
Substrate
Meas. Tech.
ChEMBL_145685 (CHEMBL753311)
IC50
0.200000±n/a nM
Citation
 Scopes, DIHayes, NFBays, DEBelton, DBrain, JBrown, DSJudd, DBMcElroy, ABMeerholz, CANaylor, A New kappa-receptor agonists based upon a 2-[(alkylamino)methyl]piperidine nucleus. J Med Chem 35:490-501 (1992)  
Target
Name:
Kappa-type opioid receptor
Synonyms:
K-OR-1 Kappa-opioid receptor (KOR) Kappa-type opioid receptor (KOR) OPIATE Kappa OPRK1 kappa opioid receptor (KOR)
Type:
G Protein-Coupled Receptor (GPCR)
Mol. Mass.:
42648.76
Organism:
Homo sapiens (Human)
Description:
P41145
Residue:
380
  
Inhibitor
Name:
BDBM50000271
Synonyms:
1-{1-[2-(3,4-Dichloro-phenyl)-acetyl]-piperidin-2-ylmethyl}-pyrrolidin-3-one | CHEMBL146519
Type:
Small organic molecule
Emp. Form.:
C18H22Cl2N2O2
Mol. Mass.:
369.285
SMILES:
Clc1ccc(CC(=O)N2CCCCC2CN2CCC(=O)C2)cc1Cl
: