Target
Kappa-type opioid receptor
Ligand
BDBM50000295
Substrate
Meas. Tech.
ChEMBL_145685 (CHEMBL753311)
IC50
120±n/a nM
Citation
 Scopes, DIHayes, NFBays, DEBelton, DBrain, JBrown, DSJudd, DBMcElroy, ABMeerholz, CANaylor, A New kappa-receptor agonists based upon a 2-[(alkylamino)methyl]piperidine nucleus. J Med Chem 35:490-501 (1992)  
Target
Name:
Kappa-type opioid receptor
Synonyms:
K-OR-1 Kappa-opioid receptor (KOR) Kappa-type opioid receptor (KOR) OPIATE Kappa OPRK1 kappa opioid receptor (KOR)
Type:
G Protein-Coupled Receptor (GPCR)
Mol. Mass.:
42648.76
Organism:
Homo sapiens (Human)
Description:
P41145
Residue:
380
  
Inhibitor
Name:
BDBM50000295
Synonyms:
2-(3,4-Dichloro-phenyl)-1-(4-hydroxy-2-pyrrolidin-1-ylmethyl-piperidin-1-yl)-ethanone | CHEMBL342965
Type:
Small organic molecule
Emp. Form.:
C18H24Cl2N2O2
Mol. Mass.:
371.301
SMILES:
O[C@@H]1CCN([C@H](CN2CCCC2)C1)C(=O)Cc1ccc(Cl)c(Cl)c1
: