Target
Thromboxane-A synthase
Ligand
BDBM50000306
Substrate
Meas. Tech.
ChEMBL_209923 (CHEMBL813714)
IC50
540±n/a nM
Citation
 Martinez, GRWalker, KAHirschfeld, DRBruno, JJYang, DSMaloney, PJ 3,4-Dihydroquinolin-2(1H)-ones as combined inhibitors of thromboxane A2 synthase and cAMP phosphodiesterase. J Med Chem 35:620-8 (1992)  
Target
Name:
Thromboxane-A synthase
Synonyms:
CYP5 Cytochrome P450 5A1 TBXAS1 TXA synthase TXS Thromboxane A2 Synthase (P450 TxA2) Thromboxane prostanoid Thromboxane-A synthase
Type:
Enzyme
Mol. Mass.:
60524.67
Organism:
Homo sapiens (Human)
Description:
P24557
Residue:
533
  
Inhibitor
Name:
BDBM50000306
Synonyms:
6-Pyridin-3-yl-3,4-dihydro-1H-quinolin-2-one 6-Pyridin-3-yl-3,4-dihydroquinolin-2(1H)-on | CHEMBL62811
Type:
Small organic molecule
Emp. Form.:
C14H12N2O
Mol. Mass.:
224.2579
SMILES:
O=C1CCc2cc(ccc2N1)-c1cccnc1
: