Target
Voltage-dependent L-type calcium channel subunit alpha-1S
Ligand
BDBM50000338
Substrate
Meas. Tech.
ChEBML_53192
Kd
570.0±n/a nM
Citation
 Kimball, SDFloyd, DMDas, JHunt, JTKrapcho, JRovnyak, GDuff, KJLee, VGMoquin, RVTurk, CF Benzazepinone calcium channel blockers. 4. Structure-activity overview and intracellular binding site. J Med Chem 35:780-93 (1992)  
Target
Name:
Voltage-dependent L-type calcium channel subunit alpha-1S
Synonyms:
CAC1S_HUMAN CACN1 CACNL1A3 Voltage-dependent L-type calcium channel subunit alpha-1S Voltage-gated L-type calcium channel alpha-1S subunit Voltage-gated calcium channel subunit alpha Cav1.1
Type:
PROTEIN
Mol. Mass.:
212348.33
Organism:
Homo sapiens (Human)
Description:
ChEMBL_42767
Residue:
1873
  
Inhibitor
Name:
BDBM50000338
Synonyms:
1-(2-Dimethylamino-ethyl)-3-methyl-4-(4-methylamino-phenyl)-6-trifluoromethyl-1,3,4,5-tetrahydro-benzo[b]azepin-2-one | CHEMBL355684
Type:
Small organic molecule
Emp. Form.:
C23H28F3N3O
Mol. Mass.:
419.4831
SMILES:
CNc1ccc(cc1)[C@@H]1Cc2c(cccc2C(F)(F)F)N(CCN(C)C)C(=O)[C@@H]1C
: