Target
Transmembrane prolyl 4-hydroxylase
Ligand
BDBM50000423
Substrate
Meas. Tech.
ChEBML_157453
IC50
31000±n/a nM
Citation
 Tucker, HThomas, DF Novel inhibitors of prolyl 4-hydroxylase. 2. 5-Amide substituted pyridine-2-carboxylic acids. J Med Chem 35:804-7 (1992)  
Target
Name:
Transmembrane prolyl 4-hydroxylase
Synonyms:
Hypoxia-inducible factor prolyl 4-hydroxylase Hypoxia-inducible factor prolyl hydroxylase 4 P4HTM PH4 | Transmembrane prolyl 4-hydroxylase
Type:
Enzyme
Mol. Mass.:
56654.25
Organism:
Homo sapiens (Human)
Description:
Q9NXG6
Residue:
502
  
Inhibitor
Name:
BDBM50000423
Synonyms:
5-(4-Fluoro-benzylamino)-pyridine-2-carboxylic acid | CHEMBL30729
Type:
Small organic molecule
Emp. Form.:
C13H11FN2O2
Mol. Mass.:
246.237
SMILES:
OC(=O)c1ccc(NCc2ccc(F)cc2)cn1
: