Target
B-cell lymphoma 6 protein
Ligand
BDBM50239362
Substrate
Meas. Tech.
ChEBML_1665991
IC50
200±n/a nM
Citation
 McCoull, WAbrams, RDAnderson, EBlades, KBarton, PBox, MBurgess, JByth, KCao, QChuaqui, CCarbajo, RJCheung, TCode, EFerguson, ADFillery, SFuller, NOGangl, EGao, NGrist, MHargreaves, DHoward, MRHu, JKemmitt, PDNelson, JEO'Connell, NPrince, DBRaubo, PRawlins, PBRobb, GRShi, JWaring, MJWhittaker, DWylot, MZhu, X Discovery of Pyrazolo[1,5-a]pyrimidine B-Cell Lymphoma 6 (BCL6) Binders and Optimization to High Affinity Macrocyclic Inhibitors. J Med Chem 60:4386-4402 (2017)  
Target
Name:
B-cell lymphoma 6 protein
Synonyms:
B-cell lymphoma 5 protein BCL-5 BCL5 BCL6_HUMAN LAZ3 ZBTB27 Zinc finger and BTB domain-containing protein 27 | Zinc finger protein 51
Type:
PROTEIN
Mol. Mass.:
78866.89
Organism:
Homo sapiens
Description:
ChEMBL_117695
Residue:
706
  
Inhibitor
Name:
BDBM50239362
Synonyms:
CHEMBL4064865
Type:
Small organic molecule
Emp. Form.:
C31H31ClN6O4
Mol. Mass.:
587.069
SMILES:
[H][C@]12C[C@@H](CO)N(C1)c1cc(Nc3cc4CCC(=O)N(Cc5ccccc5)c4c(OC\C=C\CO2)c3)n2ncc(Cl)c2n1
: