Target
Polyunsaturated fatty acid 5-lipoxygenase
Ligand
BDBM50000524
Substrate
Meas. Tech.
ChEMBL_4196 (CHEMBL619998)
IC50
52±n/a nM
Citation
 Lau, CKBélanger, PCDufresne, CScheigetz, JTherien, MFitzsimmons, BYoung, RNFord-Hutchinson, AWRiendeau, DDenis, D Development of 2,3-dihydro-6-(3-phenoxypropyl)-2-(2-phenylethyl)-5-benzofuranol (L-670,630) as a potent and orally active inhibitor of 5-lipoxygenase. J Med Chem 35:1299-318 (1992)  
Target
Name:
Polyunsaturated fatty acid 5-lipoxygenase
Synonyms:
Alox5 LOX5_RAT
Type:
PROTEIN
Mol. Mass.:
78082.31
Organism:
Rattus norvegicus
Description:
ChEMBL_1432947
Residue:
673
  
Inhibitor
Name:
BDBM50000524
Synonyms:
6-Allyl-2-[2-(4-methoxy-phenyl)-ethyl]-3,3-dimethyl-2,3-dihydro-benzofuran-5-ol | CHEMBL25530
Type:
Small organic molecule
Emp. Form.:
C22H26O3
Mol. Mass.:
338.44
SMILES:
COc1ccc(CCC2Oc3cc(CC=C)c(O)cc3C2(C)C)cc1
: