Target
Delta-type opioid receptor
Ligand
BDBM50000570
Substrate
Meas. Tech.
ChEMBL_146728 (CHEMBL753266)
Ki
>500±n/a nM
Citation
 Froimowitz, MPick, CGPasternak, GW Phenylmorphans and analogues: opioid receptor subtype selectivity and effect of conformation on activity. J Med Chem 35:1521-5 (1992)  
Target
Name:
Delta-type opioid receptor
Synonyms:
D-OR-1 Delta opioid receptor OPIATE Delta OPRD1 OPRK1 | opioid receptor, delta 1
Type:
G Protein-Coupled Receptor (GPCR)
Mol. Mass.:
40382.98
Organism:
Homo sapiens (Human)
Description:
Competition binding assays were carried out using membrane preparations from transfected HN9.10 cells that constitutively expressed the delta opioid receptor.
Residue:
372
  
Inhibitor
Name:
BDBM50000570
Synonyms:
3-(2-Methyl-2-aza-bicyclo[3.3.1]non-5-yl)-phenol | CHEMBL285250
Type:
Small organic molecule
Emp. Form.:
C15H21NO
Mol. Mass.:
231.3333
SMILES:
CN1CCC2(CCCC1C2)c1cccc(O)c1
: