Target
D(2) dopamine receptor
Ligand
BDBM50000603
Substrate
Meas. Tech.
ChEBML_62093
Ki
2300±n/a nM
Citation
 Erickson, RHNatalie, KJBock, WLu, ZFarzin, FSherrill, RGMeloni, DJPatch, RJRzesotarski, WJClifton, J (Aminoalkoxy)chromones. Selective sigma receptor ligands. J Med Chem 35:1526-35 (1992)  
Target
Name:
D(2) dopamine receptor
Synonyms:
DOPAMINE D2 DOPAMINE D2 Short Dopamine D2 receptor Drd2
Type:
G Protein-Coupled Receptor (GPCR)
Mol. Mass.:
50931.60
Organism:
Rattus norvegicus (rat)
Description:
P61169
Residue:
444
  
Inhibitor
Name:
BDBM50000603
Synonyms:
6-(6-Azepan-1-yl-hexyloxy)-2-phenyl-chromen-4-one | CHEMBL432859
Type:
Small organic molecule
Emp. Form.:
C27H33NO3
Mol. Mass.:
419.5558
SMILES:
O=c1cc(oc2ccc(OCCCCCCN3CCCCCC3)cc12)-c1ccccc1
: