Target
D(2) dopamine receptor
Ligand
BDBM50000649
Substrate
Meas. Tech.
ChEBML_62093
Ki
4500±n/a nM
Citation
 Erickson, RHNatalie, KJBock, WLu, ZFarzin, FSherrill, RGMeloni, DJPatch, RJRzesotarski, WJClifton, J (Aminoalkoxy)chromones. Selective sigma receptor ligands. J Med Chem 35:1526-35 (1992)  
Target
Name:
D(2) dopamine receptor
Synonyms:
DOPAMINE D2 DOPAMINE D2 Short Dopamine D2 receptor Drd2
Type:
G Protein-Coupled Receptor (GPCR)
Mol. Mass.:
50931.60
Organism:
Rattus norvegicus (rat)
Description:
P61169
Residue:
444
  
Inhibitor
Name:
BDBM50000649
Synonyms:
6-{6-[(2-Hydroxy-ethyl)-methyl-amino]-hexyloxy}-2-phenyl-chromen-4-one | CHEMBL38897
Type:
Small organic molecule
Emp. Form.:
C24H29NO4
Mol. Mass.:
395.4914
SMILES:
CN(CCO)CCCCCCOc1ccc2oc(cc(=O)c2c1)-c1ccccc1
: