Target
Potassium-transporting ATPase alpha chain 1/subunit beta
Ligand
BDBM50000669
Substrate
Meas. Tech.
ChEBML_76253
IC50
1290±n/a nM
Citation
 Leach, CABrown, THIfe, RJKeeling, DJLaing, SMParsons, MEPrice, CAWiggall, KJ Reversible inhibitors of the gastric (H+/K+)-ATPase. 2. 1-Arylpyrrolo[3,2-c]quinolines: effect of the 4-substituent. J Med Chem 35:1845-52 (1992)  
Target
Name:
Potassium-transporting ATPase alpha chain 1/subunit beta
Synonyms:
Potassium-transporting ATPase alpha chain 1/beta chain
Type:
Mol. Mass.:
Description:
ASSAY_ID of EBI is 76252
Components:
This complex has 2 components.
Component 1
Name:
Potassium-transporting ATPase subunit beta
Synonyms:
ATP4B_RAT Gastric H(+)/K(+) ATPase subunit beta Potassium-transporting ATPase subunit beta | Proton pump beta chain
Type:
PROTEIN
Mol. Mass.:
33694.62
Organism:
Rattus norvegicus
Description:
EBI_10720
Residue:
294
  
Component 2
Name:
Potassium-transporting ATPase alpha chain 1
Synonyms:
ATP4A_RAT Hka | Potassium-transporting ATPase
Type:
PROTEIN
Mol. Mass.:
114028.02
Organism:
Rattus norvegicus
Description:
EBI_12422
Residue:
1033
  
Inhibitor
Name:
BDBM50000669
Synonyms:
6-Methoxy-1-(2-methoxy-phenyl)-2,3-dihydro-1H-pyrrolo[3,2-c]quinoline | CHEMBL55106
Type:
Small organic molecule
Emp. Form.:
C19H18N2O2
Mol. Mass.:
306.3584
SMILES:
COc1ccccc1N1CCc2cnc3c(OC)cccc3c12
: