Target
Platelet-activating factor receptor
Ligand
BDBM50000723
Substrate
Meas. Tech.
ChEBML_155155
Ki
20500±n/a nM
Citation
 Guinn, DESummers, JBHeyman, HRConway, RGRhein, DAAlbert, DHMagoc, TCarter, GW Synthesis and structure-activity relationships of a series of novel benzopyran-containing platelet activating factor antagonists. J Med Chem 35:2055-61 (1992)  
Target
Name:
Platelet-activating factor receptor
Synonyms:
PAF-R PTAFR_CAVPO Platelet-activating factor receptor
Type:
Protein
Mol. Mass.:
39005.63
Organism:
Cavia porcellus
Description:
Residue:
342
  
Inhibitor
Name:
BDBM50000723
Synonyms:
1-{7-[4-(4-Fluoro-phenyl)-1-methyl-butyl]-5-hydroxy-10,10-dimethyl-1,2,4,10-tetrahydro-9-oxa-3-aza-phenanthren-3-yl}-2-hydroxy-ethanone | CHEMBL62503
Type:
Small organic molecule
Emp. Form.:
C27H32FNO4
Mol. Mass.:
453.5457
SMILES:
CC(CCCc1ccc(F)cc1)c1cc(O)c2C3=C(CCN(C3)C(=O)CO)C(C)(C)Oc2c1
: