Target
Platelet-activating factor receptor
Ligand
BDBM50000724
Substrate
Meas. Tech.
ChEBML_155155
Ki
9000±n/a nM
Citation
 Guinn, DESummers, JBHeyman, HRConway, RGRhein, DAAlbert, DHMagoc, TCarter, GW Synthesis and structure-activity relationships of a series of novel benzopyran-containing platelet activating factor antagonists. J Med Chem 35:2055-61 (1992)  
Target
Name:
Platelet-activating factor receptor
Synonyms:
PAF-R PTAFR_CAVPO Platelet-activating factor receptor
Type:
Protein
Mol. Mass.:
39005.63
Organism:
Cavia porcellus
Description:
Residue:
342
  
Inhibitor
Name:
BDBM50000724
Synonyms:
2-(5-Hydroxy-7-isopropyl-10,10-dimethyl-1,2,4,10-tetrahydro-9-oxa-3-aza-phenanthren-3-yl)-N-methyl-acetamide | CHEMBL65089
Type:
Small organic molecule
Emp. Form.:
C20H28N2O3
Mol. Mass.:
344.4479
SMILES:
CNC(=O)CN1CCC2=C(C1)c1c(O)cc(cc1OC2(C)C)C(C)C
: