Target
Platelet-activating factor receptor
Ligand
BDBM50000710
Substrate
Meas. Tech.
ChEBML_155155
Ki
4400±n/a nM
Citation
 Guinn, DESummers, JBHeyman, HRConway, RGRhein, DAAlbert, DHMagoc, TCarter, GW Synthesis and structure-activity relationships of a series of novel benzopyran-containing platelet activating factor antagonists. J Med Chem 35:2055-61 (1992)  
Target
Name:
Platelet-activating factor receptor
Synonyms:
PAF-R PTAFR_CAVPO Platelet-activating factor receptor
Type:
Protein
Mol. Mass.:
39005.63
Organism:
Cavia porcellus
Description:
Residue:
342
  
Inhibitor
Name:
BDBM50000710
Synonyms:
3-{7-[4-(4-Fluoro-phenyl)-1-methyl-butyl]-5-methoxy-10,10-dimethyl-1,2,4,10-tetrahydro-9-oxa-3-aza-phenanthren-3-yl}-propionic acid | CHEMBL62650
Type:
Small organic molecule
Emp. Form.:
C29H36FNO4
Mol. Mass.:
481.5988
SMILES:
COc1cc(cc2OC(C)(C)C3=C(CN(CCC(O)=O)CC3)c12)C(C)CCCc1ccc(F)cc1
: