Target
Bile salt export pump
Ligand
BDBM50054601
Substrate
Meas. Tech.
ChEMBL_1667662 (CHEMBL4017550)
IC50
110000±n/a nM
Citation
 Warner, DJChen, HCantin, LDKenna, JGStahl, SWalker, CLNoeske, T Mitigating the inhibition of human bile salt export pump by drugs: opportunities provided by physicochemical property modulation, in silico modeling, and structural modification. Drug Metab Dispos 40:2332-41 (2012)  
Target
Name:
Bile salt export pump
Synonyms:
ABCB11 ATP-binding cassette sub-family B member 11 Bile Salt Export Pump, BSEP Bile salt export pump (BSEP)
Type:
Protein
Mol. Mass.:
146405.49
Organism:
Homo sapiens (Human)
Description:
O95342
Residue:
1321
  
Inhibitor
Name:
BDBM50054601
Synonyms:
5-Methyl-N-(4-(trifluoromethyl)phenyl)-4-isoxazolecarboxamide 5-methyl-N-[4-(trifluoromethyl)phenyl]-1,2-oxazole-4-carboxamide CHEMBL960 alpha,alpha,alpha-Trifluoro-5-methyl-4-isoxazolecarboxy-p-toluidide
Type:
Small organic molecule
Emp. Form.:
C12H9F3N2O2
Mol. Mass.:
270.2073
SMILES:
Cc1oncc1C(=O)Nc1ccc(cc1)C(F)(F)F
: