Target
Prolyl 4-hydroxylase subunit alpha-1
Ligand
BDBM26106
Substrate
Meas. Tech.
ChEMBL_157460 (CHEMBL765600)
Ki
540±n/a nM
Citation
 Cunliffe, CJFranklin, TJHales, NJHill, GB Novel inhibitors of prolyl 4-hydroxylase. 3. Inhibition by the substrate analogue N-oxaloglycine and its derivatives. J Med Chem 35:2652-8 (1992)  
Target
Name:
Prolyl 4-hydroxylase subunit alpha-1
Synonyms:
P4HA1_RAT P4ha1 | Prolyl 4-hydroxylase alpha-1 subunit
Type:
PROTEIN
Mol. Mass.:
60891.28
Organism:
Rattus norvegicus
Description:
ChEMBL_157460
Residue:
534
  
Inhibitor
Name:
BDBM26106
Synonyms:
CHEMBL90852 NOG [(carboxymethyl)carbamoyl]formic acid
Type:
Small organic molecule
Emp. Form.:
C4H5NO5
Mol. Mass.:
147.0862
SMILES:
OC(=O)CNC(=O)C(O)=O
: