Target
Prolyl 4-hydroxylase subunit alpha-1
Ligand
BDBM50000863
Substrate
Meas. Tech.
ChEMBL_157458 (CHEMBL765598)
IC50
621000±n/a nM
Citation
 Cunliffe, CJFranklin, TJHales, NJHill, GB Novel inhibitors of prolyl 4-hydroxylase. 3. Inhibition by the substrate analogue N-oxaloglycine and its derivatives. J Med Chem 35:2652-8 (1992)  
Target
Name:
Prolyl 4-hydroxylase subunit alpha-1
Synonyms:
P4HA1_RAT P4ha1 | Prolyl 4-hydroxylase alpha-1 subunit
Type:
PROTEIN
Mol. Mass.:
60891.28
Organism:
Rattus norvegicus
Description:
ChEMBL_157460
Residue:
534
  
Inhibitor
Name:
BDBM50000863
Synonyms:
2-(Oxalyl-amino)-propionic acid | CHEMBL88472
Type:
Small organic molecule
Emp. Form.:
C5H7NO5
Mol. Mass.:
161.1128
SMILES:
C[C@@H](NC(=O)C(O)=O)C(O)=O
: