Target
5-hydroxytryptamine receptor 1A
Ligand
BDBM50001119
Substrate
Meas. Tech.
ChEBML_1551
Ki
0.500000±n/a nM
Citation
 Ennis, MDBaze, MESmith, MWLawson, CFMcCall, RBLahti, RAPiercey, MF Novel indolodioxanes with antihypertensive effects: potent ligands for the 5-HT1A receptor. J Med Chem 35:3058-66 (1992)  
Target
Name:
5-hydroxytryptamine receptor 1A
Synonyms:
5-HT-1A 5-hydroxytryptamine receptor 1A (5-HT-1A) ADRB2RL1 Dopamine D2 receptor and serotonin 1a receptor HTR1A | Serotonin receptor 1A
Type:
Mol. Mass.:
46122.49
Organism:
Homo sapiens (Human)
Description:
Residue:
422
  
Inhibitor
Name:
BDBM50001119
Synonyms:
8-(4-Oxo-1-phenyl-1,3,8-triaza-spiro[4.5]dec-8-ylmethyl)-7,8-dihydro-3H-6,9-dioxa-3-aza-cyclopenta[a]naphthalene-2-carbonitrile | CHEMBL101535
Type:
Small organic molecule
Emp. Form.:
C25H25N5O3
Mol. Mass.:
443.4977
SMILES:
O=C1NCN(c2ccccc2)C11CCN(CC2COc3ccc4[nH]c(cc4c3O2)C#N)CC1
: