Target
5-hydroxytryptamine receptor 1A
Ligand
BDBM50001112
Substrate
Meas. Tech.
ChEBML_1551
Ki
0.600000±n/a nM
Citation
 Ennis, MDBaze, MESmith, MWLawson, CFMcCall, RBLahti, RAPiercey, MF Novel indolodioxanes with antihypertensive effects: potent ligands for the 5-HT1A receptor. J Med Chem 35:3058-66 (1992)  
Target
Name:
5-hydroxytryptamine receptor 1A
Synonyms:
5-HT-1A 5-hydroxytryptamine receptor 1A (5-HT-1A) ADRB2RL1 Dopamine D2 receptor and serotonin 1a receptor HTR1A | Serotonin receptor 1A
Type:
Mol. Mass.:
46122.49
Organism:
Homo sapiens (Human)
Description:
Residue:
422
  
Inhibitor
Name:
BDBM50001112
Synonyms:
8-(2-Hydroxymethyl-7,8-dihydro-3H-6,9-dioxa-3-aza-cyclopenta[a]naphthalen-8-ylmethyl)-1-phenyl-1,3,8-triaza-spiro[4.5]decan-4-one | CHEMBL323088
Type:
Small organic molecule
Emp. Form.:
C25H28N4O4
Mol. Mass.:
448.5142
SMILES:
OCc1cc2c3OC(CN4CCC5(CC4)N(CNC5=O)c4ccccc4)COc3ccc2[nH]1
: