Target
Delta-type opioid receptor/Kappa-type opioid receptor/Mu-type opioid receptor/Sigma non-opioid intracellular receptor 1
Ligand
BDBM50001119
Substrate
Meas. Tech.
ChEMBL_147657 (CHEMBL756572)
Ki
0.100000±n/a nM
Citation
 Ennis, MDBaze, MESmith, MWLawson, CFMcCall, RBLahti, RAPiercey, MF Novel indolodioxanes with antihypertensive effects: potent ligands for the 5-HT1A receptor. J Med Chem 35:3058-66 (1992)  
Target
Name:
Delta-type opioid receptor/Kappa-type opioid receptor/Mu-type opioid receptor/Sigma non-opioid intracellular receptor 1
Synonyms:
Opioid receptor
Type:
Mol. Mass.:
Description:
ASSAY_ID of ChEMBL is 172778
Components:
This complex has 4 components.
Component 1
Name:
Mu-type opioid receptor
Synonyms:
MOR-1 Mu-type opioid receptor (MOR) OPRM_RAT Opioid receptor B Ror-b
Type:
G Protein-Coupled Receptor (GPCR)
Mol. Mass.:
44503.11
Organism:
Rattus norvegicus (rat)
Description:
Competition binding assays were carried out using membrane preparations from transfected HN9.10 cells that constitutively expressed the mu opioid receptor.
Residue:
398
  
Component 2
Name:
Sigma non-opioid intracellular receptor 1
Synonyms:
Opioid receptor SGMR1_RAT Sigma non-opioid intracellular receptor 1 Sigma-1 | Sigmar1
Type:
Enzyme Catalytic Domain
Mol. Mass.:
25266.54
Organism:
RAT
Description:
Q9R0C9
Residue:
223
  
Component 3
Name:
Kappa-type opioid receptor
Synonyms:
KOR-1 OPIATE Kappa Opioid receptor Ror-d
Type:
G Protein-Coupled Receptor (GPCR)
Mol. Mass.:
42692.90
Organism:
Rattus norvegicus (rat)
Description:
P34975
Residue:
380
  
Component 4
Name:
Delta-type opioid receptor
Synonyms:
Cytochrome P450 3A4 Delta opioid receptor Delta-type opioid receptor (DOR) OPRD_RAT Opioid receptor Opioid receptors; mu & delta Ror-a | Voltage-gated potassium channel
Type:
G Protein-Coupled Receptor (GPCR)
Mol. Mass.:
40465.04
Organism:
Rattus norvegicus (rat)
Description:
Competition binding assays were using CHO-K1 cell membranes expressing the opioid receptor.
Residue:
372
  
Inhibitor
Name:
BDBM50001119
Synonyms:
8-(4-Oxo-1-phenyl-1,3,8-triaza-spiro[4.5]dec-8-ylmethyl)-7,8-dihydro-3H-6,9-dioxa-3-aza-cyclopenta[a]naphthalene-2-carbonitrile | CHEMBL101535
Type:
Small organic molecule
Emp. Form.:
C25H25N5O3
Mol. Mass.:
443.4977
SMILES:
O=C1NCN(c2ccccc2)C11CCN(CC2COc3ccc4[nH]c(cc4c3O2)C#N)CC1
: