Target
Leukotriene B4 receptor 1
Ligand
BDBM50001154
Substrate
Meas. Tech.
ChEBML_96965
IC50
3000±n/a nM
Citation
 Labaudinière, RHilboll, GLeon-Lomeli, ATerlain, BCavy, FParnham, MKuhl, PDereu, N Omega-[(omega-arylalkyl)thienyl]alkanoic acids: from specific LTA4 hydrolase inhibitors to LTB4 receptor antagonists. J Med Chem 35:3170-9 (1992)  
Target
Name:
Leukotriene B4 receptor 1
Synonyms:
BLT BLTR Chemoattractant receptor-like 1 GPR16 LTB4-R 1 Leukotriene B4 R1 Leukotriene B4 receptor 1 P2Y purinoceptor 7 | P2Y7
Type:
Enzyme Catalytic Domain
Mol. Mass.:
37582.68
Organism:
Homo sapiens (Human)
Description:
Q15722
Residue:
352
  
Inhibitor
Name:
BDBM50001154
Synonyms:
6-[5-Methyl-3-(3-phenyl-propyl)-thiophen-2-ylsulfanyl]-hexanoic acid | CHEMBL109129
Type:
Small organic molecule
Emp. Form.:
C20H26O2S2
Mol. Mass.:
362.549
SMILES:
Cc1cc(CCCc2ccccc2)c(SCCCCCC(O)=O)s1
: