Target
Glutamate receptor ionotropic, NMDA 1
Ligand
BDBM50001266
Substrate
Meas. Tech.
ChEBML_140538
IC50
860±n/a nM
Citation
 McQuaid, LASmith, ECLodge, DPralong, EWikel, JHCalligaro, DOO'Malley, PJ 3-Phenyl-4-hydroxyquinolin-2(1H)-ones: potent and selective antagonists at the strychnine-insensitive glycine site on the N-methyl-D-aspartate receptor complex. J Med Chem 35:3423-5 (1992)  
Target
Name:
Glutamate receptor ionotropic, NMDA 1
Synonyms:
Glutamate (NMDA) receptor subunit zeta 1 Glutamate-NMDA-Channel Glutamate-NMDA-Polyamine NMDA Nmdar1 | phencyclidine
Type:
Enzyme Catalytic Domain
Mol. Mass.:
105533.40
Organism:
RAT
Description:
P35439
Residue:
938
  
Inhibitor
Name:
BDBM50001266
Synonyms:
5,7-DICHLORO-4-HYDROXYQUINOLINE-2-CARBOXYLIC ACID 5,7-Dichloro-4-hydroxy-quinoline-2-carboxylic acid anion 5,7-Dichloro-4-oxo-1,4-dihydro-quinoline-2-carboxylic acid CHEMBL50267
Type:
Small organic molecule
Emp. Form.:
C10H5Cl2NO3
Mol. Mass.:
258.058
SMILES:
OC(=O)c1cc(O)c2c(Cl)cc(Cl)cc2n1
: