Target
Oxytocin receptor
Ligand
BDBM50001365
Substrate
Meas. Tech.
ChEBML_149059
IC50
980.0±n/a nM
Citation
 Evans, BELeighton, JLRittle, KEGilbert, KFLundell, GFGould, NPHobbs, DWDiPardo, RMVeber, DFPettibone, DJ Orally active, nonpeptide oxytocin antagonists. J Med Chem 35:3919-27 (1992)  
Target
Name:
Oxytocin receptor
Synonyms:
OT-R Otr Oxytocin
Type:
Enzyme Catalytic Domain
Mol. Mass.:
42889.28
Organism:
RAT
Description:
Oxytocin OXTR RAT::P70536
Residue:
388
  
Inhibitor
Name:
BDBM50001365
Synonyms:
3,7,7-trimethyl-1-spiro[1H-indene-1,4'-(hexahydropyridine)]-1-ylsulfonylmethylbicyclo[2.2.1]heptan-2-ol | CHEMBL340237
Type:
Small organic molecule
Emp. Form.:
C24H33NO3S
Mol. Mass.:
415.589
SMILES:
C[C@@H]1[C@@H](O)[C@]2(CS(=O)(=O)N3CCC4(CC3)C=Cc3ccccc43)CCC1C2(C)C
: