Target
Mu-type opioid receptor
Ligand
BDBM50001458
Substrate
Meas. Tech.
ChEMBL_149134 (CHEMBL873302)
Ki
9230.0±n/a nM
Citation
 Schiller, PWWeltrowska, GNguyen, TMWilkes, BCChung, NNLemieux, C Conformationally restricted deltorphin analogues. J Med Chem 35:3956-61 (1992)  
Target
Name:
Mu-type opioid receptor
Synonyms:
MOR-1 Mu-type opioid receptor (MOR) OPRM_RAT Opioid receptor B Ror-b
Type:
G Protein-Coupled Receptor (GPCR)
Mol. Mass.:
44503.11
Organism:
Rattus norvegicus (rat)
Description:
Competition binding assays were carried out using membrane preparations from transfected HN9.10 cells that constitutively expressed the mu opioid receptor.
Residue:
398
  
Inhibitor
Name:
BDBM50001458
Synonyms:
3-[2-({2-[2-Amino-3-(4-hydroxy-phenyl)-propionyl]-1,2,3,4-tetrahydro-isoquinoline-3-carbonyl}-amino)-3-phenyl-propionylamino]-N-{1-[1-(carbamoylmethyl-carbamoyl)-2-methyl-propylcarbamoyl]-2-methyl-propyl}-succinamic acid | CHEMBL339089
Type:
Small organic molecule
Emp. Form.:
C44H56N8O10
Mol. Mass.:
856.963
SMILES:
CC(C)[C@H](NC(=O)[C@@H](NC(=O)[C@H](CC(O)=O)NC(=O)[C@H](Cc1ccccc1)NC(=O)[C@@H]1Cc2ccccc2CN1C(=O)[C@@H](N)Cc1ccc(O)cc1)C(C)C)C(=O)NCC(N)=O
: