Target
Mu-type opioid receptor
Ligand
BDBM50000518
Substrate
Meas. Tech.
ChEMBL_149135 (CHEMBL759226)
Ki
143±n/a nM
Citation
 Schiller, PWWeltrowska, GNguyen, TMWilkes, BCChung, NNLemieux, C Conformationally restricted deltorphin analogues. J Med Chem 35:3956-61 (1992)  
Target
Name:
Mu-type opioid receptor
Synonyms:
MOR-1 Mu-type opioid receptor (MOR) OPRM_RAT Opioid receptor B Ror-b
Type:
G Protein-Coupled Receptor (GPCR)
Mol. Mass.:
44503.11
Organism:
Rattus norvegicus (rat)
Description:
Competition binding assays were carried out using membrane preparations from transfected HN9.10 cells that constitutively expressed the mu opioid receptor.
Residue:
398
  
Inhibitor
Name:
BDBM50000518
Synonyms:
3-(2-{2-[2-(2-{2-[2-Amino-3-(4-hydroxy-phenyl)-propionylamino]-4-methylsulfanyl-butyrylamino}-3-phenyl-propionylamino)-3-(3H-imidazol-4-yl)-propionylamino]-4-methyl-pentanoylamino}-4-methylsulfanyl-butyrylamino)-succinamic acid CHEMBL20775
Type:
Small organic molecule
Emp. Form.:
C44H62N10O10S2
Mol. Mass.:
955.154
SMILES:
CSCC[C@@H](NC(=O)[C@@H](N)Cc1ccc(O)cc1)C(=O)N[C@@H](Cc1ccccc1)C(=O)N[C@@H](Cc1cnc[nH]1)C(=O)N[C@@H](CC(C)C)C(=O)N[C@@H](CCSC)C(=O)N[C@@H](CC(O)=O)C(N)=O
: