Target
Adenosine receptor A2a
Ligand
BDBM50001490
Substrate
Meas. Tech.
ChEBML_27629
Ki
23400±n/a nM
Citation
 Sakai, RKonno, KYamamoto, YSanae, FTakagi, KHasegawa, TIwasaki, NKakiuchi, MKato, HMiyamoto, K Effects of alkyl substitutions of xanthine skeleton on bronchodilation. J Med Chem 35:4039-44 (1992)  
Target
Name:
Adenosine receptor A2a
Synonyms:
AA2AR_CAVPO ADORA2A | Adenosine A2a receptor
Type:
Enzyme Catalytic Domain
Mol. Mass.:
44955.08
Organism:
GUINEA PIG
Description:
ADENOSINE A2 0 GUINEA PIG::P46616
Residue:
409
  
Inhibitor
Name:
BDBM50001490
Synonyms:
1-Propyl-3,7-dihydro-purine-2,6-dione | CHEMBL39986
Type:
Small organic molecule
Emp. Form.:
C8H10N4O2
Mol. Mass.:
194.1906
SMILES:
CCCn1c(=O)[nH]c2nc[nH]c2c1=O
: