Target
Adenosine receptor A2a
Ligand
BDBM50001500
Substrate
Meas. Tech.
ChEBML_71194
EC50
600±n/a nM
Citation
 Sakai, RKonno, KYamamoto, YSanae, FTakagi, KHasegawa, TIwasaki, NKakiuchi, MKato, HMiyamoto, K Effects of alkyl substitutions of xanthine skeleton on bronchodilation. J Med Chem 35:4039-44 (1992)  
Target
Name:
Adenosine receptor A2a
Synonyms:
A2A adenosine receptor (hA2A) ADENOSINE A2 ADORA2 Adenosine A2A receptor (A2AAR)
Type:
G Protein-Coupled Receptor (GPCR)
Mol. Mass.:
44716.46
Organism:
Homo sapiens (Human)
Description:
P29274
Residue:
412
  
Inhibitor
Name:
BDBM50001500
Synonyms:
7-Methyl-1,3-dipropyl-3,7-dihydro-purine-2,6-dione | CHEMBL278332
Type:
Small organic molecule
Emp. Form.:
C12H18N4O2
Mol. Mass.:
250.2969
SMILES:
CCCn1c2ncn(C)c2c(=O)n(CCC)c1=O
: