Target
Delta-type opioid receptor
Ligand
BDBM50001553
Substrate
Meas. Tech.
ChEMBL_145083 (CHEMBL857599)
Kd
40±n/a nM
Citation
 Portoghese, PSSultana, MNelson, WLKlein, PTakemori, AE Delta opioid antagonist activity and binding studies of regioisomeric isothiocyanate derivatives of naltrindole: evidence for delta receptor subtypes. J Med Chem 35:4086-91 (1992)  
Target
Name:
Delta-type opioid receptor
Synonyms:
Cytochrome P450 3A4 Delta opioid receptor Delta-type opioid receptor (DOR) OPRD_RAT Opioid receptor Opioid receptors; mu & delta Ror-a | Voltage-gated potassium channel
Type:
G Protein-Coupled Receptor (GPCR)
Mol. Mass.:
40465.04
Organism:
Rattus norvegicus (rat)
Description:
Competition binding assays were using CHO-K1 cell membranes expressing the opioid receptor.
Residue:
372
  
Inhibitor
Name:
BDBM50001553
Synonyms:
22-cyclopropylmethyl-8-isothiocyanato-14-oxa-11,22-diazaheptacyclo[13.9.1.01,13.02,21.04,12.05,10.019,25]pentacosa-4(12),5(10),6,8,15,17,19(25)-heptaene-2,16-diol | CHEMBL335295
Type:
Small organic molecule
Emp. Form.:
C27H25N3O3S
Mol. Mass.:
471.571
SMILES:
Oc1ccc2CC3N(CC4CC4)CCC45C(Oc1c24)c1[nH]c2cc(ccc2c1CC35O)N=C=S
: