Target
Nucleoside diphosphate kinase B
Ligand
BDBM50240743
Substrate
Meas. Tech.
ChEMBL_1668650 (CHEMBL4018538)
Kd
18500±n/a nM
Citation
 Wang, YQHuang, ZLChen, SBWang, CXShan, CYin, QKOu, TMLi, DGu, LQTan, JHHuang, ZS Design, Synthesis, and Evaluation of New Selective NM23-H2 Binders as c-MYC Transcription Inhibitors via Disruption of the NM23-H2/G-Quadruplex Interaction. J Med Chem 60:6924-6941 (2017)  
Target
Name:
Nucleoside diphosphate kinase B
Synonyms:
2.7.13.3 C-myc purine-binding transcription factor PUF NDK B NDP kinase B NME2 nm23-H2
Type:
PROTEIN
Mol. Mass.:
17301.87
Organism:
Homo sapiens (Human)
Description:
ChEMBL_10050
Residue:
152
  
Inhibitor
Name:
BDBM50240743
Synonyms:
CHEMBL4097029
Type:
Small organic molecule
Emp. Form.:
C28H33FN4O5
Mol. Mass.:
524.5838
SMILES:
COc1cc(\C=C2/CCn3c2nc2cc(NCCCN4CCOCC4)c(F)cc2c3=O)cc(OC)c1OC
: